{"text_format":"1","workbook":"xlsx","n_sheets":14,"sheets":["Form","Titles","Admissions","Manager or designee","Achieves","ADA","Competencies","Education","Exper","ManNon","Equip","SBU","Level","Sheet1"],"not_rendered":{"charts":0,"images":1,"macros":1,"external_links":0,"defined_names":8,"comments":0,"pivot_tables":0},"unopened":[],"bounds":{"document_bytes":16777216,"sheet_cells":100000,"rows_first":2000,"rows_last":500,"rows_between":2000,"halvings":0,"cell_chars":16384,"cell_head_chars":4096},"cells_cut":0,"cells_raw":0,"read":"whole","date_system":"1900"}

{"sheet":"Form","index":0,"n_rows":150,"n_cols":5,"rows_kept":150,"cut":false,"hidden":false,"merged":[[149,1,149,2],[149,3,149,4],[147,0,147,4],[59,1,59,4],[60,1,60,4],[61,1,61,4],[112,0,112,4],[113,0,113,4],[90,0,90,4],[91,0,91,4],[92,0,92,4],[93,0,93,4],[94,0,94,4],[68,0,68,4],[66,0,66,4],[67,0,67,4],[81,0,81,4],[69,0,69,4],[70,0,70,4],[71,0,71,4],[72,0,72,4],[73,0,73,4],[65,0,65,4],[78,0,78,4],[148,1,148,2],[148,3,148,4],[28,1,28,4],[29,1,29,4],[31,1,31,4],[32,1,32,4],[34,1,34,4],[35,1,35,4],[37,1,37,4],[38,1,38,4],[39,1,39,4],[33,1,33,4],[86,0,86,4],[40,1,40,4],[41,1,41,4],[42,0,42,4],[43,0,43,2],[62,0,62,4],[57,1,57,4],[58,1,58,4],[146,1,146,4],[143,1,143,4],[145,1,145,4],[130,0,130,4],[19,1,19,4],[0,1,0,4],[9,0,9,1],[8,0,8,1],[1,0,1,4],[10,0,10,4],[7,0,7,4],[13,1,13,4],[14,1,14,4],[15,1,15,4],[16,1,16,4],[17,1,17,4],[11,0,11,2],[5,1,5,4],[4,2,4,4],[20,1,20,4],[21,1,21,4],[22,1,22,4],[23,1,23,4],[25,1,25,4],[26,1,26,4],[27,1,27,4],[54,1,54,4],[55,1,55,4],[47,1,47,4],[48,1,48,4],[49,1,49,4],[51,1,51,4],[52,1,52,4],[142,0,142,4],[131,0,131,4],[132,0,132,4],[133,0,133,4],[134,0,134,4],[135,0,135,4],[114,0,114,4],[115,0,115,4],[144,1,144,4],[140,1,140,4],[128,3,128,4],[123,0,123,2],[124,0,124,2],[125,0,125,2],[123,3,123,4],[124,3,124,4],[125,3,125,4],[126,3,126,4],[127,3,127,4],[141,1,141,4],[136,1,136,4],[126,0,126,2],[127,0,127,2],[128,0,128,2],[79,0,79,4],[80,0,80,4],[83,0,83,4],[82,0,82,4],[84,0,84,4],[85,0,85,4],[45,1,45,4],[46,1,46,4],[63,0,63,2],[53,1,53,4],[64,0,64,4],[76,0,76,4],[77,0,77,4],[75,0,75,4],[74,0,74,4],[95,0,95,4],[96,0,96,4],[119,3,119,4],[120,3,120,4],[121,3,121,4],[122,3,122,4],[87,0,87,4],[88,0,88,4],[89,0,89,4],[118,3,118,4],[117,3,117,4],[117,0,117,2],[118,0,118,2],[119,0,119,2],[120,0,120,2],[121,0,121,2],[122,0,122,2],[97,0,97,4],[98,0,98,4],[99,0,99,4],[100,0,100,4],[101,0,101,4],[129,1,129,4],[137,0,137,4],[138,1,138,4],[139,1,139,4],[102,0,102,4],[103,0,103,4],[104,0,104,4],[105,0,105,4],[106,0,106,4],[107,0,107,4],[108,0,108,4],[109,0,109,4],[110,0,110,4],[111,0,111,4],[116,0,116,4]]}
[null,"    UNIVERSITY OF MASSACHUSETTS MEDICAL SCHOOL\n"]
["POSITION DESCRIPTION\n"]
["Job Title:","Job Code:    ","Department: ","L.U.:","Grade:"]
[null,{"$f":"VLOOKUP(A4,Titles!A1:B1527,2,FALSE)","v":{"$error":"#N/A"}}]
["SBU"]
["Manager/Non Manager"]
["POSITION SUMMARY:  "]
[]
[]
["Under general supervision of the:"]
["ESSENTIAL FUNCTIONS"]
[null,null,null,"%"]
[]
[]
[]
{"$rows_left_out":136}
{"sheet":"Titles","index":1,"n_rows":1527,"n_cols":2,"rows_kept":1527,"cut":false,"hidden":true,"merged":[]}
["Academic Administrator I","MB2044"]
["Academic Administrator II","MB2045"]
["Academic Administrator III","MB2047"]
["Academic Administrator IV","MB2048"]
["Academic Personnel Specialist","MB1014"]
["Academic Resrch Administrator","MB2046"]
["Accountant Staff II - Grant","MF2009"]
["Accountant, AR & Billing Spec","MF0039"]
["Accountant, Staff  I FS/CHCF","MF2023"]
["Accountant, Staff Ii","MF2011"]
["Accountant, Staff III","MF2007"]
["Accountant, Staff IV","MB0152"]
["Accountant, Staff IV - Grant","MF2005"]
["Accountant,Staff I","MF2066"]
["Accountant,Staff III-Grant","MF2061"]
{"$rows_left_out":1513}
{"sheet":"Admissions","index":2,"n_rows":219,"n_cols":1,"rows_kept":219,"cut":false,"hidden":true,"merged":[]}
["Access Control"]
["Access Control - Lobbies"]
["Administration & Finance"]
["Admissions"]
["Adv-Advancement Services"]
["Adv-Alumni & Parent Relations"]
["Adv-Annual Funds"]
["Adv-Cancer Walk"]
["Adv-Central Admin/Operations"]
["Adv-Communication & Stewardshp"]
["Adv-Corp/Foundation Relatns"]
["Adv-Events"]
["Adv-Executive Office"]
["Adv-Grateful Patient Program"]
["Adv-Individual Giving"]
{"$rows_left_out":205}
{"sheet":"Manager or designee","index":3,"n_rows":6,"n_cols":1,"rows_kept":6,"cut":false,"hidden":true,"merged":[]}
["Vice Chancellor or designee"]
["Senior Director or designee"]
["Director or designee"]
["Manager or designee"]
["Supervisor or designee"]
["Principal Investigator or designee"]

{"sheet":"Achieves","index":4,"n_rows":688,"n_cols":1,"rows_kept":688,"cut":false,"hidden":true,"merged":[]}
["Abstract"]
["Accelerate"]
["Acclimate"]
["Accommodate"]
["Accompany"]
["Accomplish"]
["Accumulate"]
["Achieve"]
["Acquire"]
["Act"]
["Activate"]
["Actuate"]
["Add"]
["Address"]
["Adhere"]
{"$rows_left_out":674}
{"sheet":"ADA","index":5,"n_rows":39,"n_cols":3,"rows_kept":39,"cut":false,"hidden":true,"merged":[]}
["Climbing. Ascending or descending ladders, stairs, scaffolding, ramps, poles and the like, using feet and legs and/or hands and arms. ",{"$f":"IF(COUNTIF(Form!$A$1:$A$53,A1)>=1,\"\",ROW())","v":1},{"$f":"IF(ROW(A1)-ROW(A$1)+1>COUNT(B$1:B$39),\"\",INDEX(A:A,SMALL(B$1:B$39,1+ROW(A1)-ROW(A$1))))","v":"Climbing. Ascending or descending ladders, stairs, scaffolding, ramps, poles and the like, using feet and legs and/or hands and arms. "}]
["Balancing. Maintaining body equilibrium to prevent falling and walking, standing or crouching on narrow, slippery, or erratically moving surfaces. ",{"$f":"IF(COUNTIF(Form!$A$119:$A$129,A2)>=1,\"\",ROW())","v":2},{"$f":"IF(ROW(A2)-ROW(A$1)+1>COUNT(B$1:B$39),\"\",INDEX(A:A,SMALL(B$1:B$39,1+ROW(A2)-ROW(A$1))))","v":"Balancing. Maintaining body equilibrium to prevent falling and walking, standing or crouching on narrow, slippery, or erratically moving surfaces. "}]
["Stooping. Bending body downward and forward by bending spine at the waist. ",{"$f":"IF(COUNTIF(Form!$A$119:$A$129,A3)>=1,\"\",ROW())","v":3},"Stooping. Bending body downward and forward by bending spine at the waist. "]
["Kneeling. Bending legs at knee to come to a rest on knee or knees.",{"$f":"IF(COUNTIF(Form!$A$119:$A$129,A4)>=1,\"\",ROW())","v":4},"Kneeling. Bending legs at knee to come to a rest on knee or knees."]
["Crouching. Bending the body downward and forward by bending leg and spine.",{"$f":"IF(COUNTIF(Form!$A$119:$A$129,A5)>=1,\"\",ROW())","v":5},"Crouching. Bending the body downward and forward by bending leg and spine."]
["Crawling. Moving about on hands and knees or hands and feet in flat or uneven surfaces",{"$f":"IF(COUNTIF(Form!$A$119:$A$129,A6)>=1,\"\",ROW())","v":6},"Crawling. Moving about on hands and knees or hands and feet in flat or uneven surfaces"]
["Reaching. Extending hand(s) and arm(s) in any direction.",{"$f":"IF(COUNTIF(Form!$A$119:$A$129,A7)>=1,\"\",ROW())","v":7},"Reaching. Extending hand(s) and arm(s) in any direction."]
["Standing. Particularly for sustained periods of time.",{"$f":"IF(COUNTIF(Form!$A$119:$A$129,A8)>=1,\"\",ROW())","v":8},"Standing. Particularly for sustained periods of time."]
["Walking. Moving about on foot to accomplish tasks, particularly for long distances or moving from one work site to another.",{"$f":"IF(COUNTIF(Form!$A$119:$A$129,A9)>=1,\"\",ROW())","v":9},"Walking. Moving about on foot to accomplish tasks, particularly for long distances or moving from one work site to another."]
["Pushing. Using upper extremities to press against something with steady force in order to thrust forward, downward or outward.",{"$f":"IF(COUNTIF(Form!$A$119:$A$129,A10)>=1,\"\",ROW())","v":10},"Pushing. Using upper extremities to press against something with steady force in order to thrust forward, downward or outward."]
["Pulling. Using upper extremities to exert force in order to draw, haul or tug objects in a sustained motion.",{"$f":"IF(COUNTIF(Form!$A$119:$A$129,A11)>=1,\"\",ROW())","v":11},"Pulling. Using upper extremities to exert force in order to draw, haul or tug objects in a sustained motion."]
["Lifting. Raising objects from a lower to a higher position or moving objects horizontally from position-to-position. This factor is important if it occurs to a considerable degree and requires substantial use of upper extremities and back muscles.",{"$f":"IF(COUNTIF(Form!$A$119:$A$129,A12)>=1,\"\",ROW())","v":12},"Lifting. Raising objects from a lower to a higher position or moving objects horizontally from position-to-position. This factor is important if it occurs to a considerable degree and requires substantial use of upper extremities and back muscles."]
["Fingering. Picking, pinching, typing or otherwise working, primarily with fingers rather than with the whole hand as in handling.",{"$f":"IF(COUNTIF(Form!$A$119:$A$129,A13)>=1,\"\",ROW())","v":13},"Fingering. Picking, pinching, typing or otherwise working, primarily with fingers rather than with the whole hand as in handling."]
["Grasping. Applying pressure to an object with the fingers and palm.",{"$f":"IF(COUNTIF(Form!$A$119:$A$129,A14)>=1,\"\",ROW())","v":14},"Grasping. Applying pressure to an object with the fingers and palm."]
["Feeling. Perceiving attributes of objects, such as size, shape, temperature or texture by touching with skin, particularly that of fingertips.",{"$f":"IF(COUNTIF(Form!$A$119:$A$129,A15)>=1,\"\",ROW())","v":15},"Feeling. Perceiving attributes of objects, such as size, shape, temperature or texture by touching with skin, particularly that of fingertips."]
{"$rows_left_out":25}
{"sheet":"Competencies","index":6,"n_rows":60,"n_cols":3,"rows_kept":60,"cut":false,"hidden":true,"merged":[]}
["Accounting - Knowledge of traditional accounting practices including accrual, obligations, and costs methods.",{"$f":"IF(COUNTIF(Form!$A$113:$A$117,A1)>=1,\"\",ROW())","v":1},{"$f":"IF(ROW(A1)-ROW(A$1)+1>COUNT(B$1:B$61),\"\",INDEX(A:A,SMALL(B$1:B$61,1+ROW(A1)-ROW(A$1))))","v":"Accounting - Knowledge of traditional accounting practices including accrual, obligations, and costs methods."}]
["Budget Administration - Knowledge of the principles and practices of budget administration and analysis; including preparing, justifying, reporting on, and executing the budget.",{"$f":"IF(COUNTIF(Form!$A$113:$A$117,A2)>=1,\"\",ROW())","v":2},{"$f":"IF(ROW(A2)-ROW(A$1)+1>COUNT(B$1:B$61),\"\",INDEX(A:A,SMALL(B$1:B$61,1+ROW(A2)-ROW(A$1))))","v":"Budget Administration - Knowledge of the principles and practices of budget administration and analysis; including preparing, justifying, reporting on, and executing the budget."}]
["Clerical - Knowledge of filing, typing, entering data, maintaining records, taking shorthand, and using and completing forms.                                                    ",{"$f":"IF(COUNTIF(Form!$A$113:$A$117,A3)>=1,\"\",ROW())","v":3},"Clerical - Knowledge of filing, typing, entering data, maintaining records, taking shorthand, and using and completing forms.                                                    "]
["Coaching and Motivating - Works to improve and reinforce performance of others. Facilitates their skill development by providing clear, behaviorally specific performance feedback, and making or eliciting specific suggestions for improvement.",{"$f":"IF(COUNTIF(Form!$A$113:$A$117,A4)>=1,\"\",ROW())","v":4},"Coaching and Motivating - Works to improve and reinforce performance of others. Facilitates their skill development by providing clear, behaviorally specific performance feedback, and making or eliciting specific suggestions for improvement."]
["Communications and Media - Knowledge of the production, communication and dissemination of information and ideas to inform and entertain via written, oral, and visual media.",{"$f":"IF(COUNTIF(Form!$A$113:$A$117,A5)>=1,\"\",ROW())","v":5},"Communications and Media - Knowledge of the production, communication and dissemination of information and ideas to inform and entertain via written, oral, and visual media."]
["Computer Skills - Uses computers, software applications, databases, and automated systems to accomplish work.",{"$f":"IF(COUNTIF(Form!$A$113:$A$117,A6)>=1,\"\",ROW())","v":6},"Computer Skills - Uses computers, software applications, databases, and automated systems to accomplish work."]
["Conflict Management - Encourages creative tension and differences of opinions. Anticipates and takes steps to prevent counter -productive confrontations. Manages and resolves conflicts and disagreements in a constructive manner.",{"$f":"IF(COUNTIF(Form!$A$113:$A$117,A7)>=1,\"\",ROW())","v":7},"Conflict Management - Encourages creative tension and differences of opinions. Anticipates and takes steps to prevent counter -productive confrontations. Manages and resolves conflicts and disagreements in a constructive manner."]
["Confidentiality - Respects and adheres to ethical principles and confidentiality regarding any sensitive information or documents used as part of professional activity.",{"$f":"IF(COUNTIF(Form!$A$113:$A$117,A8)>=1,\"\",ROW())","v":8},"Confidentiality - Respects and adheres to ethical principles and confidentiality regarding any sensitive information or documents used as part of professional activity."]
["Conscientiousness - Displays a high level of effort and commitment towards performing work; demonstrates responsible behavior.",{"$f":"IF(COUNTIF(Form!$A$113:$A$117,A9)>=1,\"\",ROW())","v":9},"Conscientiousness - Displays a high level of effort and commitment towards performing work; demonstrates responsible behavior."]
["Continual Learning - Assesses and recognizes own strengths and weaknesses; pursues self –development.",{"$f":"IF(COUNTIF(Form!$A$113:$A$117,A10)>=1,\"\",ROW())","v":10},"Continual Learning - Assesses and recognizes own strengths and weaknesses; pursues self –development."]
["Creativity and Innovation - Develops new insights into situations. Questions conventional approaches. Encourages new ideas and innovations. Designs and implements new or cutting edge programs/processes.",{"$f":"IF(COUNTIF(Form!$A$113:$A$117,A11)>=1,\"\",ROW())","v":11},"Creativity and Innovation - Develops new insights into situations. Questions conventional approaches. Encourages new ideas and innovations. Designs and implements new or cutting edge programs/processes."]
["Data Analysis - Identifies and reports key metrics, statistics, data trends, and abnormalities using tools such as Excel, SAS, SQL, R and Access.",{"$f":"IF(COUNTIF(Form!$A$113:$A$117,A12)>=1,\"\",ROW())","v":12},"Data Analysis - Identifies and reports key metrics, statistics, data trends, and abnormalities using tools such as Excel, SAS, SQL, R and Access."]
["Data Security/Confidentiality - Understands the importance of protecting confidential data and the security of systems and fully complies with all legal, regulatory, and organizational policies.",{"$f":"IF(COUNTIF(Form!$A$113:$A$117,A13)>=1,\"\",ROW())","v":13},"Data Security/Confidentiality - Understands the importance of protecting confidential data and the security of systems and fully complies with all legal, regulatory, and organizational policies."]
["Dependability - Arrives on time to work, meetings and appointments. Adheres to schedule. Follows up on decisions, actions, and commitments.",{"$f":"IF(COUNTIF(Form!$A$113:$A$117,A14)>=1,\"\",ROW())","v":14},"Dependability - Arrives on time to work, meetings and appointments. Adheres to schedule. Follows up on decisions, actions, and commitments."]
["Developing Others - Develops the ability of others to perform and contribute to UMMS by providing ongoing feedback and by providing opportunities to learn through formal and informal methods.",{"$f":"IF(COUNTIF(Form!$A$113:$A$117,A15)>=1,\"\",ROW())","v":15},"Developing Others - Develops the ability of others to perform and contribute to UMMS by providing ongoing feedback and by providing opportunities to learn through formal and informal methods."]
{"$rows_left_out":46}
{"sheet":"Education","index":7,"n_rows":18,"n_cols":1,"rows_kept":18,"cut":false,"hidden":true,"merged":[]}
["No educational requirement specified"]
["HS Graduate "]
["HS Graduate or equivalent"]
["Technical School"]
["Technical School or equivalent"]
["2-Year College Degree"]
["2-Year College Degree or equivalent"]
["Bachelor's Level Degree"]
["Bachelor's Level Degree or equivalent"]
["Master's Level Degree"]
["Master's Level Degree or equivalent"]
["Doctorate (Academic)"]
["Doctorate (Academic) or equivalent"]
["Doctorate (Professional)"]
["Doctorate (Professional) or equivalent"]
{"$rows_left_out":4}
{"sheet":"Exper","index":8,"n_rows":6,"n_cols":1,"rows_kept":6,"cut":false,"hidden":true,"merged":[]}
["No prior experience necessary"]
["1 - 2 years"]
["3 - 5 years"]
["5 - 10 years"]
["10 - 20 years"]
["20+ years"]

{"sheet":"ManNon","index":9,"n_rows":2,"n_cols":1,"rows_kept":2,"cut":false,"hidden":true,"merged":[]}
["Individual Contributor - No direct reports"]
["Management - Has direct reports"]

{"sheet":"Equip","index":10,"n_rows":7,"n_cols":3,"rows_kept":7,"cut":false,"hidden":true,"merged":[]}
["Telephone",{"$f":"IF(COUNTIF(Form!$A$132:$A$136,A1)>=1,\"\",ROW())","v":1},{"$f":"IF(ROW(A1)-ROW(A$1)+1>COUNT(B$1:B$7),\"\",INDEX(A:A,SMALL(B$1:B$7,1+ROW(A1)-ROW(A$1))))","v":"Telephone"}]
["Fax",{"$f":"IF(COUNTIF(Form!$A$132:$A$136,A2)>=1,\"\",ROW())","v":2},{"$f":"IF(ROW(A2)-ROW(A$1)+1>COUNT(B$1:B$7),\"\",INDEX(A:A,SMALL(B$1:B$7,1+ROW(A2)-ROW(A$1))))","v":"Fax"}]
["Copier/Scanner",{"$f":"IF(COUNTIF(Form!$A$132:$A$136,A3)>=1,\"\",ROW())","v":3},"Copier/Scanner"]
["Computer",{"$f":"IF(COUNTIF(Form!$A$132:$A$136,A4)>=1,\"\",ROW())","v":4},"Computer"]
["Light machinery",{"$f":"IF(COUNTIF(Form!$A$132:$A$136,A5)>=1,\"\",ROW())","v":5},"Light machinery"]
["Heavy machinery",{"$f":"IF(COUNTIF(Form!$A$132:$A$136,A6)>=1,\"\",ROW())","v":6},"Heavy machinery"]
["Lab equipment",{"$f":"IF(COUNTIF(Form!$A$132:$A$136,A7)>=1,\"\",ROW())","v":7},"Lab equipment"]

{"sheet":"SBU","index":11,"n_rows":4,"n_cols":1,"rows_kept":4,"cut":false,"hidden":true,"merged":[]}
["CWM"]
["MBL"]
["SCHOOL"]
["Various"]

{"sheet":"Level","index":12,"n_rows":3,"n_cols":1,"rows_kept":3,"cut":false,"hidden":true,"merged":[]}
["Occasional position requirement"]
["Frequent position requirement"]
["Constant position requirement "]

{"sheet":"Sheet1","index":13,"n_rows":36,"n_cols":7,"rows_kept":36,"cut":false,"hidden":true,"merged":[[35,6,35,10],[24,6,24,10],[25,6,25,10],[26,6,26,10],[27,6,27,10],[28,6,28,10],[29,6,29,10],[30,6,30,10],[31,6,31,10],[32,6,32,10],[33,6,33,10],[34,6,34,10],[23,6,23,10],[12,6,12,10],[13,6,13,10],[14,6,14,10],[15,6,15,10],[16,6,16,10],[17,6,17,10],[18,6,18,10],[19,6,19,10],[20,6,20,10],[21,6,21,10],[22,6,22,10],[30,0,30,4],[31,0,31,4],[4,6,4,10],[5,6,5,10],[6,6,6,10],[7,6,7,10],[8,6,8,10],[9,6,9,10],[10,6,10,10],[11,6,11,10],[24,0,24,4],[25,0,25,4],[26,0,26,4],[27,0,27,4],[28,0,28,4],[29,0,29,4],[23,0,23,4],[12,0,12,4],[13,0,13,4],[14,0,14,4],[15,0,15,4],[16,0,16,4],[17,0,17,4],[18,0,18,4],[19,0,19,4],[20,0,20,4],[21,0,21,4],[22,0,22,4],[11,0,11,4],[0,0,0,4],[1,0,1,4],[2,0,2,4],[3,0,3,4],[4,0,4,4],[5,0,5,4],[6,0,6,4],[7,0,7,4],[8,0,8,4],[9,0,9,4],[10,0,10,4]]}
["PROBLEM SOLVING/DECISION MAKING"]
["Identifies and analyzes problems weighing the relevance and accuracy of available information "]
["Generates and evaluates alternative solutions and makes effective and timely decisions"]
["Reviews the effects and implications of decisions and takes appropriate follow up actions"]
["QUANTITY/QUALITY of WORK",null,null,null,null,null,"ACCOUNTABILITY"]
["Pays close attention to detail",null,null,null,null,null,"Holds self and others accountable for measurable, high-quality, timely, and cost effective results "]
["Strives to achieve accuracy and consistency in all tasks",null,null,null,null,null,"Consistently demonstrates energy, enthusiasm, and maximum effort in completing responsibilities "]
["Organizes work to achieve maximum productivity",null,null,null,null,null,"Demonstrates flexibility in response to changing environmental priorities "]
["Actively applies strategies and tactics that routinely deliver results ",null,null,null,null,null,"Accepts personal responsibility for own actions, including errors"]
["Follows all safety rules, proactively works to prevent accidents, and encourages the use of sound judgment in order to comply with departmental and UMMS safety policies and procedures",null,null,null,null,null,"Supports other team members by prioritizing and altering daily routines to complete assignments"]
["Produces a consistently high volume of work that also meets quality standards",null,null,null,null,null,"Complies with established policies, procedures, and rules "]
["SERVICE ORIENTATION",null,null,null,null,null,"Participates in cross-functional teams  "]
["Applies effective interpersonal and problem-solving skills when responding to customers",null,null,null,null,null,"INITIATIVE"]
["Treats all internal and external customers with respect and courtesy",null,null,null,null,null,"Takes prompt action to accomplish tasks and meet goals and objectives "]
["Understands the needs and expectations of customers and anticipates how to fulfill them",null,null,null,null,null,"Completes assignments with minimal direct oversight "]
{"$rows_left_out":21}