{"text_format":"1","workbook":"xlsx","n_sheets":5,"sheets":["Form","Categories","SBU","Departments","Titles"],"not_rendered":{"charts":1,"images":2,"macros":1,"external_links":0,"defined_names":1,"comments":0,"pivot_tables":0},"unopened":[],"bounds":{"document_bytes":16777216,"sheet_cells":100000,"rows_first":2000,"rows_last":500,"rows_between":2000,"halvings":0,"cell_chars":16384,"cell_head_chars":4096},"cells_cut":0,"cells_raw":0,"read":"whole","date_system":"1900"}

{"sheet":"Form","index":0,"n_rows":125,"n_cols":9,"rows_kept":125,"cut":false,"hidden":false,"merged":[[97,0,97,4],[106,0,106,4],[92,2,92,3],[112,3,112,4],[88,0,96,1],[95,2,95,3],[89,2,89,3],[110,0,110,4],[98,0,98,4],[91,2,91,3],[104,0,104,4],[94,2,94,3],[107,0,107,4],[90,2,90,3],[93,2,93,3],[120,3,120,4],[119,0,119,2],[123,3,123,4],[8,0,8,2],[10,0,10,2],[9,0,9,2],[11,0,11,2],[13,0,13,2],[15,0,15,2],[12,0,12,2],[49,0,49,2],[53,0,53,2],[46,0,46,2],[47,0,47,2],[44,0,44,2],[48,0,48,2],[33,0,33,4],[38,0,38,2],[39,0,39,2],[26,0,26,2],[70,0,70,2],[72,0,72,2],[112,0,112,2],[102,0,102,4],[123,1,123,2],[56,0,56,2],[57,0,57,2],[121,1,121,2],[28,0,28,2],[17,0,17,4],[122,1,122,2],[87,0,87,1],[87,2,87,3],[88,2,88,3],[40,0,40,4],[121,3,121,4],[58,0,58,2],[43,0,43,2],[59,0,59,4],[122,3,122,4],[54,0,54,2],[55,0,55,2],[119,3,119,4],[84,0,84,2],[81,0,81,2],[111,0,111,4],[113,0,113,4],[105,0,105,4],[86,0,86,4],[51,0,51,4],[0,0,0,4],[2,3,2,4],[3,3,3,4],[7,0,7,4],[6,0,6,4],[1,3,1,4],[4,3,4,4],[5,3,5,4],[35,0,35,2],[24,0,24,4],[32,0,32,4],[85,0,85,4],[30,0,30,2],[20,0,20,2],[21,0,21,2],[22,0,22,2],[60,0,60,4],[62,0,62,2],[63,0,63,2],[64,0,64,2],[65,0,65,2],[66,0,66,4],[124,0,124,4],[14,0,14,2],[18,0,18,4],[23,0,23,4],[41,0,41,4],[77,0,77,2],[82,0,82,2],[27,0,27,2],[78,0,78,2],[83,0,83,2],[69,0,69,2],[71,0,71,2],[73,0,73,2],[74,0,74,4],[75,0,75,4],[79,0,79,2],[80,0,80,2],[29,0,29,2],[31,0,31,2],[50,0,50,4],[36,0,36,2],[37,0,37,2],[45,0,45,2],[67,0,67,4],[114,0,114,4],[115,0,115,4],[116,0,116,4],[118,0,118,4],[109,0,109,4],[99,0,99,4],[100,0,100,4],[108,0,108,4],[103,0,103,4],[101,0,101,4],[117,2,117,3],[117,0,117,1]]}
[]
["Employee Name:",null,"Employee ID:"]
["Manager Name:",null,"Manager Phone #:"]
["Department:",null,"Title:"]
["SBU:",null,"Review Period (From):"]
["Provides supervision?:",null,"Review Period (To):"]
["PART I REVIEW OF CURRENT YEAR'S OBJECTIVES  "]
["1=Did not accomplish, 2=Partially accomplished, 3=Fully and successfully accomplished, 4=Outcome exceeded established objective, 5=Produced outstanding result"]
["Objective #1: Outcome and Measures",null,null,"Self","Reviewer",null,null,null," "]
[null,null,null,null,null,null,null,1," "]
["Objective #2: Outcome and Measures",null,null,"Self","Reviewer",null,null,2]
[null,null,null,null,null,null,null,3]
["Objective #3: Outcome and Measures",null,null,"Self","Reviewer",null,null,4]
[null,null,null,null,null,null,null,5]
["Objective #4: Outcome and Measures",null,null,"Self","Reviewer"]
[]
[null,"Reviewer's rating for objectives:",{"$f":"IF(E10>0,AVERAGE(E10:E16),\" \")","v":" "}]
["PART II  OBSERVATIONS OF CORE COMPETENCIES  ",null,null,null,null,null,null,0," "]
["1 = Needs significant improvement, 2 = Opportunity for development, 3 = Achieves standard, 4 = Exceeds standard, 5 = Distinguished performance"]
["PROBLEM SOLVING/DECISION MAKING","Reviewer's rating:",{"$f":"IF(SUM(E21:E23)>0,AVERAGE(E21:E23),\" \")","v":" "},"Self","Reviewer",null,null,1," "]
["Identifies and analyzes problems weighing the relevance and accuracy of available information and recognizing one's filters, privileges, biases, and cultural preferences",null,null,null,null,{"$f":"VLOOKUP(C21,$H$18:$I$25,2)","v":" "},null,2," "]
["Generates and evaluates alternative solutions and makes effective and timely decisions",null,null,null,null,{"$f":"VLOOKUP(C22,$H$18:$I$25,2)","v":" "},null,3," "]
["Reviews the effects and implications of decisions and takes appropriate follow up actions",null,null,null,null,{"$f":"VLOOKUP(C23,$H$18:$I$25,2)","v":" "},null,4]
["Support for rating:",null,null,null,null,null,null,5]
[]
["QUANTITY/QUALITY of WORK","Reviewer's rating:",{"$f":"IF(SUM(E27:E32)>0,AVERAGE(E27:E32),\" \")","v":" "},"Self","Reviewer"]
["Pays close attention to detail"]
["Strives to achieve accuracy and consistency in all tasks"]
["Organizes work to achieve maximum productivity"]
["Actively applies strategies and tactics that routinely deliver results "]
["Follows all safety rules, proactively works to prevent accidents, and encourages the use of sound judgment in order to comply with departmental and UMMS safety policies and procedures"]
["Produces a consistently high volume of work that also meets quality standards"]
["Support for rating:"]
[]
["SERVICE ORIENTATION","Reviewer's rating:",{"$f":"IF(SUM(E36:E40)>0,AVERAGE(E36:E40),\" \")","v":" "},"Self","Reviewer"]
["Applies effective interpersonal and problem-solving skills when responding to clients"]
["Treats all of our diverse internal and external clients with respect and courtesy"]
["Understands the needs and expectations of diverse clients and anticipates how to fulfill them"]
["Demonstrates cultural sensitivity and competence when interacting with clients, fellow employees, and guests"]
["Takes personal responsibility applying proactive, solution focused approaches in responding to client needs"]
{"$rows_left_out":86}
{"sheet":"Categories","index":1,"n_rows":60,"n_cols":9,"rows_kept":60,"cut":false,"hidden":true,"merged":[]}
["Accounting - Knowledge of traditional accounting practices including accrual, obligations, and costs methods.",{"$f":"IF(COUNTIF(Form!$A$70:$A$74,A1)>=1,\"\",ROW())","v":1},{"$f":"IF(ROW(A1)-ROW(A$1)+1>COUNT(B$1:B$61),\"\",INDEX(A:A,SMALL(B$1:B$61,1+ROW(A1)-ROW(A$1))))","v":"Accounting - Knowledge of traditional accounting practices including accrual, obligations, and costs methods."},null,null,null,null,null,"Management - I have direct reports"]
["Budget Administration - Knowledge of the principles and practices of budget administration and analysis; including preparing, justifying, reporting on, and executing the budget.",{"$f":"IF(COUNTIF(Form!$A$70:$A$74,A2)>=1,\"\",ROW())","v":""},{"$f":"IF(ROW(A2)-ROW(A$1)+1>COUNT(B$1:B$61),\"\",INDEX(A:A,SMALL(B$1:B$61,1+ROW(A2)-ROW(A$1))))","v":"Clerical - Knowledge of filing, typing, entering data, maintaining records, taking shorthand, and using and completing forms.                                                    "},null,null,null,null,null,"Individual Contributor - No direct reports"]
["Clerical - Knowledge of filing, typing, entering data, maintaining records, taking shorthand, and using and completing forms.                                                    ",{"$f":"IF(COUNTIF(Form!$A$70:$A$74,A3)>=1,\"\",ROW())","v":3},"Coaching and Motivating - Works to improve and reinforce performance of others. Facilitates their skill development by providing clear, behaviorally specific performance feedback, and making or eliciting specific suggestions for improvement."]
["Coaching and Motivating - Works to improve and reinforce performance of others. Facilitates their skill development by providing clear, behaviorally specific performance feedback, and making or eliciting specific suggestions for improvement.",{"$f":"IF(COUNTIF(Form!$A$70:$A$74,A4)>=1,\"\",ROW())","v":4},"Computer Skills - Uses computers, software applications, databases, and automated systems to accomplish work."]
["Communications and Media - Knowledge of the production, communication and dissemination of information and ideas to inform and entertain via written, oral, and visual media.",{"$f":"IF(COUNTIF(Form!$A$70:$A$74,A5)>=1,\"\",ROW())","v":""},"Conflict Management - Encourages creative tension and differences of opinions. Anticipates and takes steps to prevent counter -productive confrontations. Manages and resolves conflicts and disagreements in a constructive manner."]
["Computer Skills - Uses computers, software applications, databases, and automated systems to accomplish work.",{"$f":"IF(COUNTIF(Form!$A$70:$A$74,A6)>=1,\"\",ROW())","v":6},"Conscientiousness - Displays a high level of effort and commitment towards performing work; demonstrates responsible behavior."]
["Conflict Management - Encourages creative tension and differences of opinions. Anticipates and takes steps to prevent counter -productive confrontations. Manages and resolves conflicts and disagreements in a constructive manner.",{"$f":"IF(COUNTIF(Form!$A$70:$A$74,A7)>=1,\"\",ROW())","v":7},"Continual Learning - Assesses and recognizes own strengths and weaknesses; pursues self –development."]
["Confidentiality - Respects and adheres to ethical principles and confidentiality regarding any sensitive information or documents used as part of professional activity.",{"$f":"IF(COUNTIF(Form!$A$70:$A$74,A8)>=1,\"\",ROW())","v":""},"Creativity and Innovation - Develops new insights into situations. Questions conventional approaches. Encourages new ideas and innovations. Designs and implements new or cutting edge programs/processes."]
["Conscientiousness - Displays a high level of effort and commitment towards performing work; demonstrates responsible behavior.",{"$f":"IF(COUNTIF(Form!$A$70:$A$74,A9)>=1,\"\",ROW())","v":9},"Data Analysis - Identifies and reports key metrics, statistics, data trends, and abnormalities using tools such as Excel, SAS, SQL, R and Access."]
["Continual Learning - Assesses and recognizes own strengths and weaknesses; pursues self –development.",{"$f":"IF(COUNTIF(Form!$A$70:$A$74,A10)>=1,\"\",ROW())","v":10},"Data Security/Confidentiality - Understands the importance of protecting confidential data and the security of systems and fully complies with all legal, regulatory, and organizational policies."]
["Creativity and Innovation - Develops new insights into situations. Questions conventional approaches. Encourages new ideas and innovations. Designs and implements new or cutting edge programs/processes.",{"$f":"IF(COUNTIF(Form!$A$70:$A$74,A11)>=1,\"\",ROW())","v":11},"Dependability - Arrives on time to work, meetings and appointments. Adheres to schedule. Follows up on decisions, actions, and commitments."]
["Data Analysis - Identifies and reports key metrics, statistics, data trends, and abnormalities using tools such as Excel, SAS, SQL, R and Access.",{"$f":"IF(COUNTIF(Form!$A$70:$A$74,A12)>=1,\"\",ROW())","v":12},"Developing Others - Develops the ability of others to perform and contribute to UMMS by providing ongoing feedback and by providing opportunities to learn through formal and informal methods."]
["Data Security/Confidentiality - Understands the importance of protecting confidential data and the security of systems and fully complies with all legal, regulatory, and organizational policies.",{"$f":"IF(COUNTIF(Form!$A$70:$A$74,A13)>=1,\"\",ROW())","v":13},"Entrepreneurship - Positions UMMS for future success by identifying new opportunities. Builds the organization by developing or improving products or services. Takes calculated risks to accomplish organizational objectives."]
["Dependability - Arrives on time to work, meetings and appointments. Adheres to schedule. Follows up on decisions, actions, and commitments.",{"$f":"IF(COUNTIF(Form!$A$70:$A$74,A14)>=1,\"\",ROW())","v":14},"Execution - Actively implements strategies that routinely deliver results. Anticipates and surmounts any obstacles that might get in the way of achieving stated objectives."]
["Developing Others - Develops the ability of others to perform and contribute to UMMS by providing ongoing feedback and by providing opportunities to learn through formal and informal methods.",{"$f":"IF(COUNTIF(Form!$A$70:$A$74,A15)>=1,\"\",ROW())","v":15},"External Awareness - Understands and keeps up -to -date on local, national, and international policies and trends that affect the organization and shape stakeholders' views; is aware of the organization's impact on the external environment."]
["Entrepreneurship - Positions UMMS for future success by identifying new opportunities. Builds the organization by developing or improving products or services. Takes calculated risks to accomplish organizational objectives.",{"$f":"IF(COUNTIF(Form!$A$70:$A$74,A16)>=1,\"\",ROW())","v":16},"Facilitation - Directs group discussions to identify key issues, to examine options and evidence, and to build consensus around potential solutions."]
["Execution - Actively implements strategies that routinely deliver results. Anticipates and surmounts any obstacles that might get in the way of achieving stated objectives.",{"$f":"IF(COUNTIF(Form!$A$70:$A$74,A17)>=1,\"\",ROW())","v":17},"Financial Management - Understands the organization's financial processes. Prepares, justifies, and administers the program budget. Oversees procurement and contracting to achieve desired results."]
["External Awareness - Understands and keeps up -to -date on local, national, and international policies and trends that affect the organization and shape stakeholders' views; is aware of the organization's impact on the external environment.",{"$f":"IF(COUNTIF(Form!$A$70:$A$74,A18)>=1,\"\",ROW())","v":18},"Flexibility - Is open to change and new information; rapidly adapts to new information, changing conditions, or unexpected obstacles."]
["Facilitation - Directs group discussions to identify key issues, to examine options and evidence, and to build consensus around potential solutions.",{"$f":"IF(COUNTIF(Form!$A$70:$A$74,A19)>=1,\"\",ROW())","v":19},"Grants Management - Knowledge of requirements, practices, and procedures for soliciting, receiving, reviewing, and processing proposals, and awarding and administering grants and agreements."]
["Financial Management - Understands the organization's financial processes. Prepares, justifies, and administers the program budget. Oversees procurement and contracting to achieve desired results.",{"$f":"IF(COUNTIF(Form!$A$70:$A$74,A20)>=1,\"\",ROW())","v":20},"Health Care Financing Knowledge - Understanding the variety of methods by which health care is paid for, particularly in regard to populations who have low incomes, disabilities or are otherwise reliant on public programs."]
["Flexibility - Is open to change and new information; rapidly adapts to new information, changing conditions, or unexpected obstacles.",{"$f":"IF(COUNTIF(Form!$A$70:$A$74,A21)>=1,\"\",ROW())","v":21},"Health Care System Knowledge - Understanding of how the health care is organized and delivered in the U.S., particularly in regard to populations who have low incomes, disabilities or are otherwise reliant on public programs."]
["Grants Management - Knowledge of requirements, practices, and procedures for soliciting, receiving, reviewing, and processing proposals, and awarding and administering grants and agreements.",{"$f":"IF(COUNTIF(Form!$A$70:$A$74,A22)>=1,\"\",ROW())","v":22},"Influencing/Negotiating - Persuades others. Builds consensus through give and take. Gains cooperation from others to obtain information and accomplish goals."]
["Health Care Financing Knowledge - Understanding the variety of methods by which health care is paid for, particularly in regard to populations who have low incomes, disabilities or are otherwise reliant on public programs.",{"$f":"IF(COUNTIF(Form!$A$70:$A$74,A23)>=1,\"\",ROW())","v":23},"Integrity/Honesty - Behaves in an honest, fair, and ethical manner. Shows consistency in words and actions. Models high standards of ethics."]
["Health Care System Knowledge - Understanding of how the health care is organized and delivered in the U.S., particularly in regard to populations who have low incomes, disabilities or are otherwise reliant on public programs.",{"$f":"IF(COUNTIF(Form!$A$70:$A$74,A24)>=1,\"\",ROW())","v":24},"Interaction with Others - Works cooperatively and collegially with others to share appropriate information, authority, responsibility, and resources. Treats others with respect and dignity."]
["Influencing/Negotiating - Persuades others. Builds consensus through give and take. Gains cooperation from others to obtain information and accomplish goals.",{"$f":"IF(COUNTIF(Form!$A$70:$A$74,A25)>=1,\"\",ROW())","v":25},"Interpersonal Communication - Connects effectively with others in person. Treats others with courtesy, sensitivity, and respect. Considers and responds appropriately to the needs and feelings of different people in different situations."]
["Integrity/Honesty - Behaves in an honest, fair, and ethical manner. Shows consistency in words and actions. Models high standards of ethics.",{"$f":"IF(COUNTIF(Form!$A$70:$A$74,A26)>=1,\"\",ROW())","v":26},"Job Knowledge - Understands job responsibilities and scope of authority. Understands and applies functional concepts and skills necessary to accomplish job tasks."]
["Interaction with Others - Works cooperatively and collegially with others to share appropriate information, authority, responsibility, and resources. Treats others with respect and dignity.",{"$f":"IF(COUNTIF(Form!$A$70:$A$74,A27)>=1,\"\",ROW())","v":27},"Learning - Uses efficient learning techniques to acquire and apply new knowledge and skills; uses training, feedback, or other opportunities for self-learning and development."]
["Interpersonal Communication - Connects effectively with others in person. Treats others with courtesy, sensitivity, and respect. Considers and responds appropriately to the needs and feelings of different people in different situations.",{"$f":"IF(COUNTIF(Form!$A$70:$A$74,A28)>=1,\"\",ROW())","v":28},"Legal Analysis - Familiarity with state and federal health care laws; ability to draft and interpret legislation, regulations, contracts and other legal documents."]
["Job Knowledge - Understands job responsibilities and scope of authority. Understands and applies functional concepts and skills necessary to accomplish job tasks.",{"$f":"IF(COUNTIF(Form!$A$70:$A$74,A29)>=1,\"\",ROW())","v":29},"Leveraging Diversity - Fosters an inclusive workplace where diversity and individual differences are valued and leveraged to achieve the vision and mission of UMMS."]
["Learning - Uses efficient learning techniques to acquire and apply new knowledge and skills; uses training, feedback, or other opportunities for self-learning and development.",{"$f":"IF(COUNTIF(Form!$A$70:$A$74,A30)>=1,\"\",ROW())","v":30},"Listening - Receives, attends to, interprets, and responds to verbal messages and other cues such as body language in ways that are appropriate to listeners and situations, along with the ability to recall information."]
["Legal Analysis - Familiarity with state and federal health care laws; ability to draft and interpret legislation, regulations, contracts and other legal documents.",{"$f":"IF(COUNTIF(Form!$A$70:$A$74,A31)>=1,\"\",ROW())","v":31},"Manages Resources - Selects, acquires, stores, and distributes resources such as materials, equipment, or money."]
["Leveraging Diversity - Fosters an inclusive workplace where diversity and individual differences are valued and leveraged to achieve the vision and mission of UMMS.",{"$f":"IF(COUNTIF(Form!$A$70:$A$74,A32)>=1,\"\",ROW())","v":32},"Managing Client Relationships - Understands the techniques required to develop, maintain and manage business relationships to implement and manage projects and to identify new business opportunities."]
["Listening - Receives, attends to, interprets, and responds to verbal messages and other cues such as body language in ways that are appropriate to listeners and situations, along with the ability to recall information.",{"$f":"IF(COUNTIF(Form!$A$70:$A$74,A33)>=1,\"\",ROW())","v":33},"Negotiation - Works with others towards an agreement that may involve exchanging specific resources or resolving differences."]
["Manages Resources - Selects, acquires, stores, and distributes resources such as materials, equipment, or money.",{"$f":"IF(COUNTIF(Form!$A$70:$A$74,A34)>=1,\"\",ROW())","v":34},"Partnering - Develops networks and builds alliances; collaborates across boundaries to build strategic relationships and achieve common goals."]
["Managing Client Relationships - Understands the techniques required to develop, maintain and manage business relationships to implement and manage projects and to identify new business opportunities.",{"$f":"IF(COUNTIF(Form!$A$70:$A$74,A35)>=1,\"\",ROW())","v":35},"Policy Analysis - Knowledge of public policy process and the ability to develop and assess public policies using tools such as literature review, qualitative and quantitative data gathering and analysis, statistics, and cost -benefit analysis."]
["Negotiation - Works with others towards an agreement that may involve exchanging specific resources or resolving differences.",{"$f":"IF(COUNTIF(Form!$A$70:$A$74,A36)>=1,\"\",ROW())","v":36},"Political Savvy - Identifies the internal and external politics that impact the work of UMMS. Perceives organizational and political reality and acts accordingly."]
["Partnering - Develops networks and builds alliances; collaborates across boundaries to build strategic relationships and achieve common goals.",{"$f":"IF(COUNTIF(Form!$A$70:$A$74,A37)>=1,\"\",ROW())","v":37},"Professional Credibility - Understands and appropriately applies principles, procedures, requirements, regulations, and policies related to specialized expertise."]
["Policy Analysis - Knowledge of public policy process and the ability to develop and assess public policies using tools such as literature review, qualitative and quantitative data gathering and analysis, statistics, and cost -benefit analysis.",{"$f":"IF(COUNTIF(Form!$A$70:$A$74,A38)>=1,\"\",ROW())","v":38},"Professional Presence - Presents oneself through dress, demeanor and interpersonal behavior in a manner that conveys knowledge, perspective, honesty, openness, self -assurance, and poise, and that inspires trust and confidence in others."]
["Political Savvy - Identifies the internal and external politics that impact the work of UMMS. Perceives organizational and political reality and acts accordingly.",{"$f":"IF(COUNTIF(Form!$A$70:$A$74,A39)>=1,\"\",ROW())","v":39},"Project Management - Knowledge of the principles, methods, or tools for developing, scheduling, coordinating, and managing projects and resources, including monitoring and inspecting costs, work, and contractor performance."]
["Professional Credibility - Understands and appropriately applies principles, procedures, requirements, regulations, and policies related to specialized expertise.",{"$f":"IF(COUNTIF(Form!$A$70:$A$74,A40)>=1,\"\",ROW())","v":40},"Promoting Collaboration - Looks for opportunities to make connections with other areas within UMMS. Considers and includes internal stakeholders from across the enterprise when planning and making decisions in which they have an interest."]
{"$rows_left_out":21}
{"sheet":"SBU","index":2,"n_rows":4,"n_cols":1,"rows_kept":4,"cut":false,"hidden":true,"merged":[]}
["School"]
["MBL"]
["CWM"]
["Various"]

{"sheet":"Departments","index":3,"n_rows":219,"n_cols":1,"rows_kept":219,"cut":false,"hidden":true,"merged":[]}
["Access Control"]
["Access Control - Lobbies"]
["Administration & Finance"]
["Admissions"]
["Adv-Advancement Services"]
["Adv-Alumni & Parent Relations"]
["Adv-Annual Funds"]
["Adv-Cancer Walk"]
["Adv-Central Admin/Operations"]
["Adv-Communication & Stewardshp"]
["Adv-Corp/Foundation Relatns"]
["Adv-Events"]
["Adv-Executive Office"]
["Adv-Grateful Patient Program"]
["Adv-Individual Giving"]
["Adv-UMMMC Giving"]
["Anesthesiology"]
["Animal Medicine"]
["ASC-Lab Glass Cleaning Svc"]
["ASG"]
["Benefits Coord. Consult."]
["Biochemistry & Molecular Pharm"]
["Bioinformatics & Integratv Bio"]
["Bookstore"]
["Cancer Research Office (CRO)"]
["CANDO"]
["Cardiovascular Medicine"]
["Cell Biology"]
["Center for Clinical Research"]
["Certified Patient Instruct."]
["Chancellor"]
["CHCF - Administration"]
["CHCF - Financial Compliance"]
["CHCF Financial Management"]
["CHCF Support"]
["Client Relations"]
["Clinical Informatics"]
["Communications"]
["Continuing Care Units"]
["Continuing Education"]
{"$rows_left_out":180}
{"sheet":"Titles","index":4,"n_rows":1526,"n_cols":1,"rows_kept":1526,"cut":false,"hidden":true,"merged":[]}
["Academic Administrator I"]
["Academic Administrator II"]
["Academic Administrator III"]
["Academic Administrator IV"]
["Academic Personnel Specialist"]
["Academic Resrch Administrator"]
["Accountant Staff II - Grant"]
["Accountant, AR & Billing Spec"]
["Accountant, Staff  I FS/CHCF"]
["Accountant, Staff Ii"]
["Accountant, Staff III"]
["Accountant, Staff IV"]
["Accountant, Staff IV - Grant"]
["Accountant,Staff I"]
["Accountant,Staff III-Grant"]
["Accounting Manager CHCF"]
["Accounting Supv - Properties"]
["Accounts Payable Coord II"]
["Accounts Payable Coord III"]
["Accounts Payable Coordinator I"]
["Accts Payable Rep, Sr."]
["Accts Payble and Payroll Spt"]
["ACIO, Academic Technology"]
["ACIO, Bus Rel & Consulting"]
["ACIO, Infrastructure Services"]
["ACIO, Project Management Ofc"]
["ACIO, Rsch Comp & Data Innov"]
["Activity Coordinator"]
["Adm Dir, Grad Med Ed"]
["Admin Assistant I"]
["Admin Assistant II"]
["Admin Asst I"]
["Admin Asst II"]
["Admin Coord - CWM Operations"]
["Admin Dir,Student Affairs"]
["Admin Manager I"]
["Admin Manager II"]
["Admin Manager III"]
["Admin Manager IV"]
["Admin, Contracts Division"]
{"$rows_left_out":1486}